{"text_format":"3","workbook":"xlsx","n_sheets":10,"sheets":["化学工艺系学硕","化学工艺系专硕","化学工程系学硕","化学工程系专硕","能源与催化工程系学硕","能源与催化工程系专硕","环境科学与工程系学硕","环境科学与工程系专硕","工程管理","非全日制材料与化工单考生"],"not_rendered":{"external_links":1},"read":"whole","date_system":"1900"}

{"sheet":"化学工艺系学硕","index":0,"n_rows":80,"n_cols":12,"rows_kept":80,"merged":[[0,0,0,11],[1,0,1,5]]}
["化学工程与环境学院2021级全日制硕士研究生复试成绩汇总暨拟录取名单统计表"]
["复试小组名称： 化学工艺系（学术型）"]
["序号","考生编号","姓名","面试专业成绩","面试英语成绩","复试成绩","初试成绩","总成绩","是否拟录取","拟录取专业","考生来源(推免/优秀营员/统考)","备注"]
[1,null,"夏丹",null,null,{"v":87,"d":"87.00"},null,null,"是","化学工程与技术","推免","助管"]
[2,null,"钱锦秀",null,null,85.92,null,null,"是","化学工程与技术","推免"]
[3,null,"马雯妍",null,null,{"v":86.2,"d":"86.20"},null,null,"是","化学工程与技术","推免","助管"]
[4,null,"吴剑",null,null,{"v":86.2,"d":"86.20"},null,null,"是","化学工程与技术","推免"]
[5,null,"韩肖宁",null,null,{"v":88.2,"d":"88.20"},null,null,"是","化学工程与技术","推免"]
[6,null,"邱皓月",null,null,{"v":87.2,"d":"87.20"},null,null,"是","化学工程与技术","推免","助管"]
[7,null,"张建超",null,null,82.24,null,null,"是","化学工程与技术","推免"]
[8,null,"喻婉婷",null,null,{"v":83.6,"d":"83.60"},null,null,"是","化学工程与技术","推免"]
[9,null,"马小娟",null,null,89.88,null,null,"是","化学工程与技术","推免"]
[10,"114141137023321","王鹏军",{"v":86.3333333333333,"d":"86.33"},{"v":86.6666666666667,"d":"86.67"},{"v":86.4666666666667,"d":"86.47"},404,{"v":82.5,"d":"82.50"},"是","化学工程与技术","夏令营优秀营员"]
[11,"114141161034500","韩轲",{"v":85,"d":"85.00"},{"v":85.3333333333333,"d":"85.33"},{"v":85.1333333333333,"d":"85.13"},386,79.58,"是","化学工程与技术","夏令营优秀营员"]
[12,"114141165054919","杨翰林",{"v":86,"d":"86.00"},84.67,85.47,375,{"v":78.141,"d":"78.14"},"是","化学工程与技术","夏令营优秀营员"]
[13,"114141111641386","王檀",{"v":85,"d":"85.00"},{"v":86,"d":"86.00"},{"v":85.4,"d":"85.40"},368,77.14,"是","化学工程与技术","夏令营优秀营员"]
[14,"114141111641056","赵翔宇",{"v":88.6666666666667,"d":"88.67"},{"v":88.3333333333333,"d":"88.33"},{"v":88.5333333333333,"d":"88.53"},360,76.96,"是","化学工程与技术","夏令营优秀营员"]
[15,"114141111641053","陈俊阳",{"v":88.3333333333333,"d":"88.33"},{"v":82.3333333333333,"d":"82.33"},{"v":85.9333333333333,"d":"85.93"},340,73.38,"是","化学工程与技术","夏令营优秀营员"]
[16,"114141111641115","蓝帆",{"v":90,"d":"90.00"},{"v":90.6666666666667,"d":"90.67"},{"v":90.2666666666667,"d":"90.27"},328,{"v":73,"d":"73.00"},"是","化学工程与技术","夏令营优秀营员"]
[17,"114141111641029","刘束玉",{"v":89,"d":"89.00"},{"v":89,"d":"89.00"},{"v":89,"d":"89.00"},325,{"v":72.2,"d":"72.20"},"是","化学工程与技术","夏令营优秀营员"]
{"$rows_left_out":61}
{"sheet":"化学工艺系专硕","index":1,"n_rows":39,"n_cols":13,"rows_kept":39,"merged":[[0,0,0,12],[1,0,1,5]]}
["化学工程与环境学院2021级全日制专业学位硕士研究生复试成绩汇总暨拟录取名单统计表"]
["复试小组名称： 化学工艺系（专业型）"]
["序号","考生编号","姓名","面试专业成绩","面试英语成绩","复试成绩","初试成绩","总成绩","是否拟录取","拟录取专业","考生来源(推免/优秀营员/统考)","工作站","备注"]
[1,"114141137023326","苑显龙",{"v":87.6666666666667,"d":"87.67"},{"v":84.3333333333333,"d":"84.33"},{"v":86.3333333333333,"d":"86.33"},"384",79.66,"是","材料与化工","夏令营优秀营员"]
[2,"114141121022493","李宇慧",{"v":88,"d":"88.00"},{"v":88.3333333333333,"d":"88.33"},{"v":88.1333333333333,"d":"88.13"},"373",78.66,"是","材料与化工","夏令营优秀营员"]
[3,"114141121102589","王梦",{"v":89.6666666666667,"d":"89.67"},{"v":87.3333333333333,"d":"87.33"},{"v":88.7333333333333,"d":"88.73"},"336",73.66,"是","材料与化工","夏令营优秀营员"]
[4,"114141121162643","熊传煌",{"v":84,"d":"84.00"},{"v":74.1666666666667,"d":"74.17"},81.05,"381",{"v":77.655,"d":"77.66"},"是","材料与化工","统考"]
[5,"114141113152172","王时雨",{"v":84.3333333333333,"d":"84.33"},{"v":87.1666666666667,"d":"87.17"},{"v":85.1833333333333,"d":"85.18"},"367",{"v":76.935,"d":"76.94"},"是","材料与化工","统考"]
[6,"114141137153659","穆亚鑫",{"v":78.1666666666667,"d":"78.17"},{"v":70,"d":"70.00"},{"v":75.7166666666667,"d":"75.72"},"378",{"v":75.635,"d":"75.64"},"是","材料与化工","统考"]
[7,"114141113172215","陈胜超",{"v":81.6666666666667,"d":"81.67"},{"v":77.5,"d":"77.50"},{"v":80.4166666666667,"d":"80.42"},"362",{"v":74.805,"d":"74.81"},"是","材料与化工","统考"]
[8,"114141151104310","李长永",{"v":78.8333333333333,"d":"78.83"},{"v":80,"d":"80.00"},{"v":79.1833333333333,"d":"79.18"},"362",{"v":74.435,"d":"74.44"},"是","材料与化工","统考"]
[9,"114141137063444","尹蓉蓉",{"v":81.3333333333333,"d":"81.33"},{"v":76.6666666666667,"d":"76.67"},{"v":79.9333333333333,"d":"79.93"},"356",73.82,"是","材料与化工","统考"]
[10,"114141161034499","郭佳鹏",{"v":77.3333333333333,"d":"77.33"},{"v":68.3333333333333,"d":"68.33"},{"v":74.6333333333333,"d":"74.63"},"367",73.77,"是","材料与化工","统考"]
[11,"114141134063065","宋良宇",{"v":78.8333333333333,"d":"78.83"},{"v":60.8333333333333,"d":"60.83"},{"v":73.4333333333333,"d":"73.43"},"363",72.85,"是","材料与化工","统考"]
[12,"114141137033364","李汝振",{"v":83.6666666666667,"d":"83.67"},{"v":83.6666666666667,"d":"83.67"},{"v":83.6666666666667,"d":"83.67"},"341",72.84,"是","材料与化工","统考"]
[13,"114141137063440","孙晓旭",{"v":79.5,"d":"79.50"},{"v":70.5,"d":"70.50"},{"v":76.8,"d":"76.80"},"351",72.18,"是","材料与化工","统考"]
[14,"114141137013234","周琳睿",{"v":84.3333333333333,"d":"84.33"},{"v":73.3333333333333,"d":"73.33"},{"v":81.0333333333333,"d":"81.03"},"339",71.77,"是","材料与化工","统考"]
[15,"114141143154101","赵赛",{"v":77.3333333333333,"d":"77.33"},{"v":63,"d":"63.00"},{"v":73.0333333333333,"d":"73.03"},"356",71.75,"是","材料与化工","统考"]
[16,"114141137063446","张旭",{"v":80.6666666666667,"d":"80.67"},{"v":76.3333333333333,"d":"76.33"},{"v":79.3666666666667,"d":"79.37"},"336",70.85,"是","材料与化工","统考"]
[17,"114141141523928","江志虎",{"v":75.5,"d":"75.50"},{"v":62.6666666666667,"d":"62.67"},71.65,"350",{"v":70.495,"d":"70.50"},"是","材料与化工","统考"]
{"$rows_left_out":20}
{"sheet":"化学工程系学硕","index":2,"n_rows":54,"n_cols":12,"rows_kept":54,"merged":[[0,0,0,11],[1,0,1,5]]}
["化学工程与环境学院2021级全日制硕士研究生复试成绩汇总暨拟录取名单统计表"]
["复试小组名称： 化学工程系（学术型）"]
["序号","考生编号","姓名","面试专业成绩","面试英语成绩","复试成绩","初试成绩","总成绩","是否拟录取","拟录取专业","考生来源(推免/优秀营员/统考)","备注"]
[1,null,"潘惠媛",null,null,91.33,null,null,"是","化学工程与技术","推免"]
[2,null,"王艺慧",null,null,{"v":91.2,"d":"91.20"},null,null,"是","化学工程与技术","推免","助管"]
[3,null,"李梦",null,null,89.13,null,null,"是","化学工程与技术","推免"]
[4,null,"宋雨珍",null,null,{"v":87.4,"d":"87.40"},null,null,"是","化学工程与技术","推免"]
[5,null,"李昕阳",null,null,{"v":86,"d":"86.00"},null,null,"是","化学工程与技术","推免","助管"]
[6,null,"李湍",null,null,85.66,null,null,"是","化学工程与技术","推免","助管"]
[7,null,"李孟原",null,null,{"v":85.2,"d":"85.20"},null,null,"是","化学工程与技术","推免"]
[8,null,"张琳怡",null,null,{"v":80,"d":"80.00"},null,null,"是","化学工程与技术","推免"]
[9,"114141111641395","朱悦",{"v":87.3333333333333,"d":"87.33"},{"v":86,"d":"86.00"},{"v":86.8,"d":"86.80"},"372",{"$f":"G12/5*0.7+F12*0.3","v":78.12},"是","化学工程与技术","夏令营优秀营员"]
[10,"114141121102571","杜洋",{"v":88.3333333333333,"d":"88.33"},{"v":89.3333333333333,"d":"89.33"},{"v":88.7333333333333,"d":"88.73"},"346",75.06,"是","化学工程与技术","夏令营优秀营员"]
[11,"114141137013228","苏涧雯",{"v":87,"d":"87.00"},{"v":86,"d":"86.00"},{"v":86.6,"d":"86.60"},"345",74.28,"是","化学工程与技术","夏令营优秀营员"]
[12,"114141111641158","石硕",{"v":86,"d":"86.00"},{"v":87,"d":"87.00"},{"v":86.4,"d":"86.40"},"343",73.94,"是","化学工程与技术","夏令营优秀营员"]
[13,"114141165054909","刘浪",{"v":89,"d":"89.00"},{"v":88.3,"d":"88.30"},88.72,"335",{"v":73.516,"d":"73.52"},"是","化学工程与技术","夏令营优秀营员"]
[14,"114141165054914","王飞",{"v":91,"d":"91.00"},{"v":86,"d":"86.00"},{"v":89,"d":"89.00"},"332",73.18,"是","化学工程与技术","夏令营优秀营员"]
[15,"114141111641376","何祉桥",{"v":93.6666666666667,"d":"93.67"},{"v":91,"d":"91.00"},{"v":92.6,"d":"92.60"},"321",72.72,"是","化学工程与技术","夏令营优秀营员"]
[16,"114141111641058","田雪铭",{"v":91,"d":"91.00"},{"v":92,"d":"92.00"},{"v":91.4,"d":"91.40"},"322",{"v":72.5,"d":"72.50"},"是","化学工程与技术","夏令营优秀营员"]
[17,"114141111641180","崔祎",{"v":86.6666666666667,"d":"86.67"},{"v":87.6666666666667,"d":"87.67"},{"v":87.0666666666667,"d":"87.07"},"322",{"v":71.2,"d":"71.20"},"是","化学工程与技术","夏令营优秀营员"]
{"$rows_left_out":35}
{"sheet":"化学工程系专硕","index":3,"n_rows":30,"n_cols":12,"rows_kept":30,"merged":[[0,0,0,11],[1,0,1,5]]}
["化学工程与环境学院2021级全日制专业学位硕士研究生复试成绩汇总暨拟录取名单统计表"]
["复试小组名称： 化学工程系（专业型）"]
["序号","考生编号","姓名","面试专业成绩","面试英语成绩","复试成绩","初试成绩","总成绩","是否拟录取","拟录取专业","考生来源(推免/优秀营员/统考)","备注"]
[1,null,"于川",null,null,{"v":88.6,"d":"88.60"},{"$nulls":3},"材料与化工","推免"]
[2,null,"邢希贝",null,null,81.76,{"$nulls":3},"材料与化工","推免"]
[3,"114141137073476","杨同",{"v":89,"d":"89.00"},{"v":91,"d":"91.00"},{"$f":"D6*0.7+E6*0.3","v":{"v":89.6,"d":"89.60"}},"351",{"$f":"G6/5*0.7+F6*0.3","v":76.02},"是","材料与化工","夏令营优秀营员"]
[4,"114141121462701","金姝彤",{"v":89,"d":"89.00"},{"v":85,"d":"85.00"},{"v":87.8,"d":"87.80"},"285",66.24,"是","材料与化工","夏令营优秀营员"]
[5,114141113021901,"陈俊杰",{"v":73.8333333333333,"d":"73.83"},{"v":66.2,"d":"66.20"},{"v":71.5433333333333,"d":"71.54"},"393",{"v":76.483,"d":"76.48"},"是","材料与化工","统考"]
[6,114141141563937,"张佳辉",{"v":70.8333333333333,"d":"70.83"},{"v":68,"d":"68.00"},{"v":69.9833333333333,"d":"69.98"},"387",{"v":75.175,"d":"75.18"},"是","材料与化工","统考"]
[7,114141123232895,"李国栋",{"v":85,"d":"85.00"},{"v":81,"d":"81.00"},{"v":83.8,"d":"83.80"},"355",74.84,"是","材料与化工","统考"]
[8,114141121132629,"赵晓晴",{"v":68.3333333333333,"d":"68.33"},{"v":75,"d":"75.00"},{"v":70.3333333333333,"d":"70.33"},"380",{"v":74.3,"d":"74.30"},"是","材料与化工","统考"]
[9,114141137073468,"廉开程",{"v":75,"d":"75.00"},{"v":74.6,"d":"74.60"},74.88,"360",{"v":72.864,"d":"72.86"},"是","材料与化工","统考"]
[10,"114141137063434","刘莹莹",{"v":80.5,"d":"80.50"},{"v":79.6,"d":"79.60"},80.23,"345",{"v":72.369,"d":"72.37"},"是","材料与化工","统考"]
[11,114141121032499,"刘晓东",{"v":74.1666666666667,"d":"74.17"},{"v":78,"d":"78.00"},{"v":75.3166666666667,"d":"75.32"},"352",{"v":71.875,"d":"71.88"},"是","材料与化工","统考"]
[12,114141134603101,"陈君",{"v":73.3333333333333,"d":"73.33"},{"v":73,"d":"73.00"},{"v":73.2333333333333,"d":"73.23"},"356",71.81,"是","材料与化工","统考"]
[13,114141113092052,"杨田萌",{"v":74.1666666666667,"d":"74.17"},{"v":71.8,"d":"71.80"},{"v":73.4566666666667,"d":"73.46"},"348",{"v":70.757,"d":"70.76"},"是","材料与化工","统考"]
[14,114141137143638,"邵月梅",{"v":74.1666666666667,"d":"74.17"},{"v":70.6,"d":"70.60"},{"v":73.0966666666667,"d":"73.10"},"339",{"v":69.389,"d":"69.39"},"是","材料与化工","统考"]
[15,114141137033365,"马强",{"v":72.5,"d":"72.50"},{"v":71.2,"d":"71.20"},72.11,"340",{"v":69.233,"d":"69.23"},"是","材料与化工","统考"]
[16,114141137143639,"魏少平",{"v":76.6666666666667,"d":"76.67"},{"v":65.2,"d":"65.20"},{"v":73.2266666666667,"d":"73.23"},"329",{"v":68.028,"d":"68.03"},"是","材料与化工","统考"]
[17,114141121132624,"王帅",{"v":69.1666666666667,"d":"69.17"},{"v":66.4,"d":"66.40"},{"v":68.3366666666667,"d":"68.34"},"332",{"v":66.981,"d":"66.98"},"是","材料与化工","统考"]
{"$rows_left_out":11}
{"sheet":"能源与催化工程系学硕","index":4,"n_rows":44,"n_cols":12,"rows_kept":44,"merged":[[0,0,0,11],[1,0,1,5]]}
["化学工程与环境学院2021级全日制硕士研究生复试成绩汇总暨拟录取名单统计表"]
["复试小组名称：能源与催化工程系（学术型） "]
["序号","考生编号","姓名","面试专业成绩","面试英语成绩","复试成绩","初试成绩","总成绩","是否拟录取","拟录取专业","考生来源(推免/优秀营员/统考)","备注"]
[1,null,"张铸文",null,null,85.67,null,null,"是","化学工程与技术","推免"]
[2,"114141141333865","牛慕凡",{"v":90.6666666666667,"d":"90.67"},{"v":90.3333333333333,"d":"90.33"},{"v":90.5333333333333,"d":"90.53"},{"$f":"VLOOKUP(C5:C36,[1]化学工程与技术!$A$2:$B$149,2,0)","v":"390"},{"$f":"G5/5*0.7+F5*0.3","v":81.76},"是","化学工程与技术","夏令营优秀营员"]
[3,"114141121102579","李声笛",{"v":93,"d":"93.00"},{"v":88.3333333333333,"d":"88.33"},{"v":91.1333333333333,"d":"91.13"},{"$f":"VLOOKUP(C6:C37,[1]化学工程与技术!$A$2:$B$149,2,0)","v":"351"},76.48,"是","化学工程与技术","夏令营优秀营员"]
[4,"114141111641637","海小祥",{"v":95,"d":"95.00"},{"v":90.3333333333333,"d":"90.33"},{"v":93.1333333333333,"d":"93.13"},{"$f":"VLOOKUP(C7:C38,[1]化学工程与技术!$A$2:$B$149,2,0)","v":"328"},73.86,"是","化学工程与技术","夏令营优秀营员"]
[5,"114141111641611","冯博",{"v":89.6666666666667,"d":"89.67"},{"v":89,"d":"89.00"},{"v":89.4,"d":"89.40"},{"$f":"VLOOKUP(C8:C39,[1]化学工程与技术!$A$2:$B$149,2,0)","v":"333"},73.44,"是","化学工程与技术","夏令营优秀营员"]
[6,"114141111641534","黄柯文",{"v":87.3333333333333,"d":"87.33"},{"v":81.6666666666667,"d":"81.67"},{"v":85.0666666666667,"d":"85.07"},{"$f":"VLOOKUP(C9:C40,[1]化学工程与技术!$A$2:$B$149,2,0)","v":"319"},70.18,"是","化学工程与技术","夏令营优秀营员"]
[7,"114141111641595","胡溢玚",{"v":87,"d":"87.00"},{"v":86,"d":"86.00"},{"v":86.6,"d":"86.60"},{"$f":"VLOOKUP(C10:C41,[1]化学工程与技术!$A$2:$B$149,2,0)","v":"314"},69.94,"是","化学工程与技术","夏令营优秀营员"]
[8,"114141137133605","臧宏扬",{"v":88.6666666666667,"d":"88.67"},{"v":88.6666666666667,"d":"88.67"},{"v":88.6666666666667,"d":"88.67"},{"$f":"VLOOKUP(C11:C42,[1]化学工程与技术!$A$2:$B$149,2,0)","v":"304"},69.16,"是","化学工程与技术","夏令营优秀营员"]
[9,"114141161034561","李瑞轩",{"v":77,"d":"77.00"},{"v":68,"d":"68.00"},{"v":74.3,"d":"74.30"},386,76.33,"是","化学工程与技术","统考"]
[10,"114141161034574","周宜林",{"v":78.8,"d":"78.80"},{"v":69.1666666666667,"d":"69.17"},75.91,380,{"v":75.973,"d":"75.97"},"是","化学工程与技术","统考"]
[11,"114141111641383","邴研",{"v":89.6,"d":"89.60"},{"v":71,"d":"71.00"},84.02,355,{"v":74.906,"d":"74.91"},"是","化学工程与技术","统考"]
[12,"114141137083539","孟岩",{"v":74.4,"d":"74.40"},{"v":82.6666666666667,"d":"82.67"},76.88,359,{"v":73.324,"d":"73.32"},"是","化学工程与技术","统考"]
[13,"114141111641027","贾鑫",{"v":76.2,"d":"76.20"},{"v":78.1666666666667,"d":"78.17"},76.79,350,{"v":72.037,"d":"72.04"},"是","化学工程与技术","统考"]
[14,"114141141323861","尚春丽",{"v":74.6,"d":"74.60"},{"v":71,"d":"71.00"},73.52,354,{"v":71.616,"d":"71.62"},"是","化学工程与技术","统考"]
[15,"114141137133603","王浩",{"v":75,"d":"75.00"},{"v":76,"d":"76.00"},{"v":75.3,"d":"75.30"},349,71.45,"是","化学工程与技术","统考"]
[16,"114141121462707","张哲",{"v":69.2,"d":"69.20"},{"v":78,"d":"78.00"},71.84,350,{"v":70.552,"d":"70.55"},"是","化学工程与技术","统考"]
[17,"114141121102527","张腾跃",{"v":73.6,"d":"73.60"},{"v":76.1666666666667,"d":"76.17"},74.37,341,{"v":70.051,"d":"70.05"},"是","化学工程与技术","统考"]
{"$rows_left_out":25}
{"sheet":"能源与催化工程系专硕","index":5,"n_rows":22,"n_cols":12,"rows_kept":22,"merged":[[0,0,0,11],[1,0,1,5]]}
["化学工程与环境学院2021级全日制专业学位硕士研究生复试成绩汇总暨拟录取名单统计表"]
["复试小组名称：能源与催化工程系（专业型） "]
["序号","考生编号","姓名","面试专业成绩","面试英语成绩","复试成绩","初试成绩","总成绩","是否拟录取","拟录取专业","考生来源(推免/优秀营员/统考)","备注"]
[1,"114141137023334","钟姝鑫",{"v":86.3333333333333,"d":"86.33"},{"v":85.6666666666667,"d":"85.67"},{"v":86.0666666666667,"d":"86.07"},"353",{"$f":"G4/5*0.7+F4*0.3","v":75.24},"是","材料与化工","夏令营优秀营员"]
[2,"114141137023328","张润程",{"v":90,"d":"90.00"},{"v":87,"d":"87.00"},{"v":88.8,"d":"88.80"},"364",{"v":77.6,"d":"77.60"},"是","材料与化工","夏令营优秀营员"]
[3,"114141141333869","辛露伟",{"v":78.6666666666667,"d":"78.67"},{"v":83.2,"d":"83.20"},{"$f":"D6*0.7+E6*0.3","v":{"v":80.0266666666667,"d":"80.03"}},394,{"v":79.168,"d":"79.17"},"是","材料与化工","统考"]
[4,"114141141403885","范梦凡",{"v":73.6666666666667,"d":"73.67"},{"v":74.2,"d":"74.20"},{"v":73.8266666666667,"d":"73.83"},383,{"v":75.768,"d":"75.77"},"是","材料与化工","统考"]
[5,"114141137033369","石婷婷",{"v":78.5,"d":"78.50"},{"v":85.4,"d":"85.40"},80.57,361,{"v":74.711,"d":"74.71"},"是","材料与化工","统考"]
[6,"114141161444649","张祎",{"v":83.3333333333333,"d":"83.33"},{"v":84,"d":"84.00"},{"v":83.5333333333333,"d":"83.53"},341,{"v":72.8,"d":"72.80"},"是","材料与化工","统考"]
[7,"114141163034717","乐小莉",{"v":85.5,"d":"85.50"},{"v":71.2,"d":"71.20"},81.21,341,{"v":72.103,"d":"72.10"},"是","材料与化工","统考"]
[8,"114141121012488","徐彤",{"v":75.6666666666667,"d":"75.67"},{"v":82.4,"d":"82.40"},{"v":77.6866666666667,"d":"77.69"},343,{"v":71.326,"d":"71.33"},"是","材料与化工","统考"]
[9,"114141162044668","彭博",{"v":74.5,"d":"74.50"},{"v":72.2,"d":"72.20"},73.81,343,{"v":70.163,"d":"70.16"},"是","材料与化工","统考"]
[10,"114141114112335","沈红茹",{"v":75.8333333333333,"d":"75.83"},{"v":78.8,"d":"78.80"},{"v":76.7233333333333,"d":"76.72"},335,{"v":69.917,"d":"69.92"},"是","材料与化工","统考"]
[11,"114141161034559","胡敏",{"v":90,"d":"90.00"},{"v":79.8,"d":"79.80"},86.94,313,{"v":69.902,"d":"69.90"},"是","材料与化工","统考"]
[12,"114141113152174","甄力研",{"v":88.5,"d":"88.50"},{"v":69.6,"d":"69.60"},82.83,318,{"v":69.369,"d":"69.37"},"是","材料与化工","统考"]
[13,"114141113102099","马亚婷",{"v":76.6666666666667,"d":"76.67"},{"v":78.4,"d":"78.40"},{"v":77.1866666666667,"d":"77.19"},319,{"v":67.816,"d":"67.82"},"是","材料与化工","统考"]
[14,"114141122062735","朴宇",{"v":69.5,"d":"69.50"},{"v":74,"d":"74.00"},70.85,327,{"v":67.035,"d":"67.04"},"是","材料与化工","统考"]
[15,"114141137153660","苏良健",{"v":65.8333333333333,"d":"65.83"},{"v":72.6,"d":"72.60"},{"v":67.8633333333333,"d":"67.86"},332,{"v":66.839,"d":"66.84"},"是","材料与化工","统考"]
[16,"114141137073501","王沼桂",{"v":85.6666666666667,"d":"85.67"},{"v":75,"d":"75.00"},{"v":82.4666666666667,"d":"82.47"},299,{"v":66.6,"d":"66.60"},"是","材料与化工","统考"]
[17,"114141137073490","白玉华",{"v":76.5,"d":"76.50"},{"v":77.2,"d":"77.20"},76.71,309,{"v":66.273,"d":"66.27"},"是","材料与化工","统考"]
{"$rows_left_out":3}
{"sheet":"环境科学与工程系学硕","index":6,"n_rows":45,"n_cols":12,"rows_kept":45,"merged":[[0,0,0,11],[1,0,1,5]]}
["化学工程与环境学院2021级全日制硕士研究生复试成绩汇总暨拟录取名单统计表"]
["复试小组名称： 环境科学与工程系（学术型）"]
["序号","考生编号","姓名","面试专业成绩","面试英语成绩","复试成绩","初试成绩","总成绩","是否拟录取","拟录取专业","考生来源(推免/优秀营员/统考)","备注"]
[1,null,"冯扬帆",null,null,90.67,null,null,"是","环境科学与工程","推免","助管"]
[2,null,"杨百玉",null,null,90.13,null,null,"是","环境科学与工程","推免"]
[3,null,"熊子馨",null,null,88.64,null,null,"是","环境科学与工程","推免","助管"]
[4,null,"孙雅倩",null,null,{"v":84.2,"d":"84.20"},null,null,"是","环境科学与工程","推免"]
[5,"114141111641057","李佳昕",{"v":89.3333333333333,"d":"89.33"},{"v":87,"d":"87.00"},{"v":88.4,"d":"88.40"},390,{"$f":"G8/5*0.7+F8*0.3","v":81.12},"是","环境科学与工程","夏令营优秀营员"]
[6,"114141111641546","李思萌",{"v":85,"d":"85.00"},{"v":86,"d":"86.00"},{"v":85.4,"d":"85.40"},350,74.62,"是","环境科学与工程","夏令营优秀营员"]
[7,"114141111641541","闫京瑞",{"v":86,"d":"86.00"},{"v":85,"d":"85.00"},{"$f":"D10*0.6+E10*0.4","v":{"v":85.6,"d":"85.60"}},341,73.42,"是","环境科学与工程","夏令营优秀营员"]
[8,"114141111641603","王乐琪",{"v":92.6666666666667,"d":"92.67"},{"v":92,"d":"92.00"},{"v":92.1333333333333,"d":"92.13"},326,73.28,"是","环境科学与工程","夏令营优秀营员"]
[9,"114141137083529","刘欢欢",{"v":90.6666666666667,"d":"90.67"},{"v":86.6666666666667,"d":"86.67"},{"v":89.0666666666667,"d":"89.07"},319,71.38,"是","环境科学与工程","夏令营优秀营员"]
[10,"114141111641507","宋明欣",{"v":91.6666666666667,"d":"91.67"},{"v":86,"d":"86.00"},{"v":89.4,"d":"89.40"},315,70.92,"是","环境科学与工程","夏令营优秀营员"]
[11,"114141114042283","曹瑜",{"v":85,"d":"85.00"},{"v":85,"d":"85.00"},{"v":85,"d":"85.00"},321,70.44,"是","环境科学与工程","夏令营优秀营员"]
[12,"114141111641607","刘莉莉",{"v":85.3333333333333,"d":"85.33"},{"v":85,"d":"85.00"},{"v":85.2,"d":"85.20"},313,69.38,"是","环境科学与工程","夏令营优秀营员"]
[13,"114141111641706","张怡欣",{"v":92.3333333333333,"d":"92.33"},{"v":88.3333333333333,"d":"88.33"},{"v":90.7333333333333,"d":"90.73"},275,65.72,"是","环境科学与工程","夏令营优秀营员"]
[14,"114141111641110","金鹏",{"v":82.5714285714286,"d":"82.57"},86.17,{"v":83.651,"d":"83.65"},392,{"v":79.9753,"d":"79.98"},"是","环境科学与工程","统考"]
[15,"114141132212984","韦标",{"v":90.8571428571429,"d":"90.86"},88.67,{"v":90.201,"d":"90.20"},371,{"v":79.0003,"d":"79.00"},"是","环境科学与工程","统考"]
[16,"114141111641573","曾宣凯",{"v":88.8571428571429,"d":"88.86"},84.67,{"v":87.601,"d":"87.60"},372,{"v":78.3603,"d":"78.36"},"是","环境科学与工程","统考"]
[17,"114141150094191","游恋",{"v":85.4285714285714,"d":"85.43"},{"v":76,"d":"76.00"},{"v":82.6,"d":"82.60"},379,77.84,"是","环境科学与工程","统考"]
{"$rows_left_out":26}
{"sheet":"环境科学与工程系专硕","index":7,"n_rows":26,"n_cols":12,"rows_kept":26,"merged":[[0,0,0,11],[1,0,1,5],[25,0,25,12]]}
["化学工程与环境学院2021级全日制专业学位硕士研究生复试成绩汇总暨拟录取名单统计表"]
["复试小组名称： 环境科学与工程系（专业型）"]
["序号","考生编号","姓名","面试专业成绩","面试英语成绩","复试成绩","初试成绩","总成绩","是否拟录取","拟录取专业","考生来源(推免/优秀营员/统考)","备注"]
[1,null,"包育文",null,null,87.27,null,null,"是","资源与环境","推免"]
[2,"114141151104291","李昀照",{"v":84,"d":"84.00"},{"v":82.6,"d":"82.60"},83.58,"382",{"v":78.554,"d":"78.55"},"是","资源与环境","统考"]
[3,"114141137173686","王红燕",{"v":82.4,"d":"82.40"},{"v":76.2,"d":"76.20"},80.54,"372",{"v":76.242,"d":"76.24"},"是","资源与环境","统考"]
[4,"114141115312462","张悦",{"v":85,"d":"85.00"},{"v":80,"d":"80.00"},{"v":83.5,"d":"83.50"},"363",75.87,"是","资源与环境","统考"]
[5,"114141144054140","陈茜",{"v":85.8,"d":"85.80"},{"v":78.2,"d":"78.20"},83.52,"354",{"v":74.616,"d":"74.62"},"是","资源与环境","统考"]
[6,"114141112061791","张晨",{"v":85.2,"d":"85.20"},{"v":81.2,"d":"81.20"},{"v":84,"d":"84.00"},"352",74.48,"是","资源与环境","统考"]
[7,"114141144304173","黄杰锐",{"v":79,"d":"79.00"},{"v":68.6,"d":"68.60"},75.88,"366",{"v":74.004,"d":"74.00"},"是","资源与环境","统考"]
[8,"114141111641428","谭青松",{"v":80,"d":"80.00"},{"v":74.4,"d":"74.40"},78.32,"358",{"v":73.616,"d":"73.62"},"是","资源与环境","统考"]
[9,"114141111641496","尚鹏寅",{"v":83.4,"d":"83.40"},{"v":74,"d":"74.00"},80.58,"346",{"v":72.614,"d":"72.61"},"是","资源与环境","统考"]
[10,"114141111641645","王辰予",{"v":86.8,"d":"86.80"},{"v":73,"d":"73.00"},82.66,"341",{"v":72.538,"d":"72.54"},"是","资源与环境","统考"]
[11,"114141111641304","彭然",{"v":83.8,"d":"83.80"},{"v":80.4,"d":"80.40"},82.78,"330",{"v":71.034,"d":"71.03"},"是","资源与环境","统考"]
[12,"114141144054144","叶绮彤",{"v":82.4,"d":"82.40"},{"v":80.4,"d":"80.40"},{"v":81.8,"d":"81.80"},"331",70.88,"是","资源与环境","统考"]
[13,"114141161034507","马霖楠",{"v":86.2,"d":"86.20"},{"v":83,"d":"83.00"},85.24,"317",{"v":69.952,"d":"69.95"},"是","资源与环境","统考"]
[14,"114141112111812","李思萌",{"v":85.4,"d":"85.40"},{"v":73,"d":"73.00"},81.68,"322",{"v":69.584,"d":"69.58"},"是","资源与环境","统考"]
[15,"114141135013122","陈思源",{"v":88.4,"d":"88.40"},{"v":74.6,"d":"74.60"},84.26,"316",{"v":69.518,"d":"69.52"},"是","资源与环境","统考"]
[16,"114141113152175","孙博",{"v":85,"d":"85.00"},{"v":87.6,"d":"87.60"},85.78,"308",{"v":68.854,"d":"68.85"},"是","资源与环境","统考"]
[17,"114141161364622","黄石雨",{"v":84.6,"d":"84.60"},{"v":77.4,"d":"77.40"},82.44,"314",{"v":68.692,"d":"68.69"},"是","资源与环境","统考"]
{"$rows_left_out":7}
{"sheet":"工程管理","index":8,"n_rows":8,"n_cols":12,"rows_kept":8,"merged":[[0,0,0,10],[1,0,1,6]]}
["化学工程与环境学院2021级非全日制硕士研究生复试成绩汇总暨拟录取名单统计表"]
["复试小组名称： 化学工程系（专业型）"]
["序号","考生编号","姓名","面试专业成绩","面试英语成绩","思想政治考核","复试成绩","初试成绩","总成绩","是否拟录取","拟录取专业","考生来源(推免/预录取/统考)"]
[1,"114141111640509","于书达",{"v":67,"d":"67.00"},{"v":68.4,"d":"68.40"},"87.9",{"$f":"D4*0.6+E4*0.3+F4*0.1","v":69.51},"191",{"$f":"H4/3*0.7+G4*0.3","v":{"v":65.4196666666667,"d":"65.42"}},"是","工程管理","统考"]
[2,114141143204111,"吕宗杰",{"v":73.3333333333333,"d":"73"},{"v":72.4,"d":"72"},"87.9",74.51,"179",{"v":64.1196666666667,"d":"64.12"},"是","工程管理","统考"]
[3,114141165065011,"王冬冬",75,{"v":71.4,"d":"71"},"88.9",75.31,"176",{"v":63.6596666666667,"d":"63.66"},"是","工程管理","统考"]
[4,114141121132616,"高阳",{"v":67,"d":"67.00"},{"v":68.2,"d":"68.20"},"91.9",69.85,"182",{"v":63.4216666666667,"d":"63.42"},"是","工程管理","统考"]
[5,114141165065010,"宋婷婷",{"v":65,"d":"65.00"},{"v":64.8,"d":"64.80"},"89.9",67.43,"176",{"v":61.2956666666667,"d":"61.30"},"是","工程管理","统考"]

{"sheet":"非全日制材料与化工单考生","index":9,"n_rows":4,"n_cols":11,"rows_kept":4,"merged":[[0,0,0,9],[1,0,1,5]]}
["化学工程与环境学院2021级非全日制硕士研究生复试成绩汇总暨拟录取名单统计表"]
["复试小组名称： 化学工程系（专业型）"]
["序号","考生编号","姓名","面试专业成绩","面试英语成绩","复试成绩","初试成绩","总成绩","是否拟录取","拟录取专业","考生来源(推免/预录取/统考)"]
[1,114141311640922,"付明阳",{"v":81.6666666666667,"d":"81.67"},{"v":64.2,"d":"64.20"},{"$f":"D4*0.7+E4*0.3","v":{"v":76.4266666666667,"d":"76.43"}},311,{"$f":"G4/5*0.7+F4*0.3","v":{"v":66.468,"d":"66.47"}},"是","材料与化工（单考生）","统考"]