{"text_format":"3","workbook":"xlsx","n_sheets":4,"sheets":["化学工艺组","化学工程组","工业催化组","环境化工组"],"not_rendered":{"external_links":2,"defined_names":4},"read":"whole","date_system":"1900"}

{"sheet":"化学工艺组","index":0,"n_rows":37,"n_cols":11,"rows_kept":37,"merged":[[0,0,0,10]]}
["2021年化工学院-化学工艺组博士研究生复试结果公示"]
["考生编号","姓名","专业代码","专业名称","考试方式","材料审核成绩","笔试成绩","面试成绩","复试成绩","复试总成绩","是否拟录取"]
["114140110030360","李俊","081700","化学工程与技术","申请考核制",81,95,90.24,{"v":73.144,"d":"73.14"},{"v":89.344,"d":"89.34"},"是"]
["114140110030015","杨梅","081700","化学工程与技术","申请考核制",77,90,{"v":88.3,"d":"88.30"},70.98,86.38,"是"]
["114140110030251","李玉果","081700","化学工程与技术","申请考核制",79,85,{"v":89,"d":"89.00"},{"v":70.4,"d":"70.40"},{"v":86.2,"d":"86.20"},"是"]
["114140110030132","张奇","081700","化学工程与技术","申请考核制",81,80,88.08,{"v":68.848,"d":"68.85"},{"v":85.048,"d":"85.05"},"是"]
["114140110030390","闫卫卫","081700","化学工程与技术","申请考核制",84,65,{"v":86.6,"d":"86.60"},64.96,81.76,"是"]
[{"$f":"VLOOKUP(B8:B31,[1]yxcs24135403!$A$2:$B$88,2,0)","v":"114140110030489"},"李奕菲","081700","化学工程与技术","申请考核制",72,65,{"v":86,"d":"86.00"},{"v":64.6,"d":"64.60"},{"v":79,"d":"79.00"},"是"]
["114140110030340","张安祺","081700","化学工程与技术","申请考核制",84,70,87.68,{"v":66.608,"d":"66.61"},{"v":83.408,"d":"83.41"},"否（主动放弃）"]
["114140110030424","高照","081700","化学工程与技术","申请考核制",55,80,{"v":81.5,"d":"81.50"},{"v":64.9,"d":"64.90"},{"v":75.9,"d":"75.90"},"否"]
["114140110030328","朱治明","081700","化学工程与技术","申请考核制",81,75,72.24,{"v":58.344,"d":"58.34"},{"v":74.544,"d":"74.54"},"否"]
["114140110030361","黄志江","081700","化学工程与技术","申请考核制",79,80,67.12,{"v":56.272,"d":"56.27"},{"v":72.072,"d":"72.07"},"否"]
["114140110030192","王嘉东","081700","化学工程与技术","申请考核制",87,65,{"v":67.1,"d":"67.10"},53.26,70.66,"否"]
[{"$f":"VLOOKUP(B14:B34,[1]yxcs24135403!$A$2:$B$88,2,0)","v":"114140110030399"},"王宁","081700","化学工程与技术","申请考核制",79,75,64.04,{"v":53.424,"d":"53.42"},{"v":69.224,"d":"69.22"},"否"]
[{"$f":"VLOOKUP(B15:B35,[1]yxcs24135403!$A$2:$B$88,2,0)","v":"114140110030419"},"何志鹏","081700","化学工程与技术","申请考核制",60,70,53.52,{"v":46.112,"d":"46.11"},{"v":58.112,"d":"58.11"},"否"]
[]
["考生编号","姓名","专业代码","专业名称","考试方式","材料审核成绩","笔试成绩","面试成绩","复试成绩","复试总成绩","是否拟录取"]
["114140230030533","王奥诚","081700","化学工程与技术","硕博连读",null,null,{"v":87.8,"d":"87.80"},null,{"v":87.8,"d":"87.80"},"是"]
["114140230030551","孙思远","081700","化学工程与技术","硕博连读",null,null,86.52,null,86.52,"是"]
["114140230030596","李博凤","081700","化学工程与技术","硕博连读",null,null,{"v":86.4,"d":"86.40"},null,{"v":86.4,"d":"86.40"},"是"]
["114140230030612","许顺年","081700","化学工程与技术","硕博连读",null,null,{"v":85.6,"d":"85.60"},null,{"v":85.6,"d":"85.60"},"是"]
["114140230030595","冯博汉","081700","化学工程与技术","硕博连读",null,null,{"v":85.4,"d":"85.40"},null,{"v":85.4,"d":"85.40"},"是"]
["114140230030515","邢梦可","081700","化学工程与技术","硕博连读",null,null,84.76,null,84.76,"是"]
["114140230030588","李硕凡","081700","化学工程与技术","硕博连读",null,null,{"v":83.7,"d":"83.70"},null,{"v":83.7,"d":"83.70"},"否"]
["114140230030550","孙衍鹍","081700","化学工程与技术","硕博连读",null,null,{"v":83.1,"d":"83.10"},null,{"v":83.1,"d":"83.10"},"是"]
["114140230030548","贾亦静","081700","化学工程与技术","硕博连读",null,null,{"v":83,"d":"83.00"},null,{"v":83,"d":"83.00"},"是"]
["114140230030556","蒋涛","081700","化学工程与技术","硕博连读",null,null,{"v":82.1,"d":"82.10"},null,{"v":82.1,"d":"82.10"},"是"]
["114140230030645","赵洋","081700","化学工程与技术","硕博连读",null,null,{"v":75.1,"d":"75.10"},null,{"v":75.1,"d":"75.10"},"否"]
[]
["考生编号","姓名","专业代码","专业名称","考试方式","材料审核成绩","笔试成绩","面试成绩","复试成绩","复试总成绩","是否拟录取"]
["114140110030196","侯凯军","085800","能源动力","申请考核制",83,85,{"v":90,"d":"90.00"},{"v":71,"d":"71.00"},{"v":87.6,"d":"87.60"},"是"]
["114140110030164","乔元","085800","能源动力","申请考核制",78,80,85.56,{"v":67.336,"d":"67.34"},{"v":82.936,"d":"82.94"},"是"]
["114140110030414","胡文娅","085800","能源动力","申请考核制",60,70,88.12,{"v":66.872,"d":"66.87"},{"v":78.872,"d":"78.87"},"是"]
["114140110030178","杨兴","085800","能源动力","申请考核制",65,85,81.44,{"v":65.864,"d":"65.86"},{"v":78.864,"d":"78.86"},"候补"]
[]
[]
["备注：在导师招生指标范围内，如果排名靠前的考生放弃或失去拟录取资格，导师有权在候补考生中择优录取。"]

{"sheet":"化学工程组","index":1,"n_rows":34,"n_cols":11,"rows_kept":34,"merged":[[0,0,0,10]]}
["2021年化工学院-化学工程组博士研究生复试结果公示"]
["考生编号","姓名","专业代码","专业名称","考试方式","材料审核成绩","笔试成绩","面试成绩","复试成绩","复试总成绩","是否拟录取"]
["114140110030140","曹潘","081700","化学工程与技术","申请考核制",90,80,{"v":87.8666666666667,"d":"87.87"},68.72,86.72,"是"]
["114140110030005","李傲","081700","化学工程与技术","申请考核制",90,80,86.05,67.63,85.63,"是"]
["114140110030200","万荫基","081700","化学工程与技术","申请考核制",90,75,86.48,{"v":66.888,"d":"66.89"},{"v":84.888,"d":"84.89"},"是"]
["114140110030130","高金明","081700","化学工程与技术","申请考核制",85,70,{"v":87.9,"d":"87.90"},66.74,83.74,"是"]
["114140110030223","朱玉洁","081700","化学工程与技术","申请考核制",90,70,84.48,{"v":64.6914285714286,"d":"64.69"},{"v":82.6914285714286,"d":"82.69"},"是"]
["114140110030109","王存宁","081700","化学工程与技术","申请考核制",90,65,{"v":84.8666666666667,"d":"84.87"},63.92,81.92,"候补"]
["114140110030156","王丽敏","081700","化学工程与技术","申请考核制",90,65,{"v":84.4666666666667,"d":"84.47"},63.68,81.68,"是"]
["114140110030346","王有佳","081700","化学工程与技术","申请考核制",85,45,{"v":85.5428571428571,"d":"85.54"},{"v":60.3257142857143,"d":"60.33"},77.32,"是"]
["114140110030137","董世强","081700","化学工程与技术","申请考核制",85,60,{"v":73.4666666666667,"d":"73.47"},56.08,73.08,"否"]
[]
["考生编号","姓名","专业代码","专业名称","考试方式","材料审核成绩","笔试成绩","面试成绩","复试成绩","复试总成绩","是否拟录取"]
["114140230030602","陈弘男","081700","化学工程与技术","硕博连读",null,null,88.95,null,88.95,"是"]
["114140230030618","张凌玮","081700","化学工程与技术","硕博连读",null,null,{"v":87.5333333333333,"d":"87.53"},null,{"v":87.5333333333333,"d":"87.53"},"是"]
["114140230030524","蔡敏","081700","化学工程与技术","硕博连读",null,null,{"v":87.2571428571429,"d":"87.26"},null,{"v":87.2571428571429,"d":"87.26"},"是"]
["114140230030598","金伟星","081700","化学工程与技术","硕博连读",null,null,{"v":83.9,"d":"83.90"},null,{"v":83.9,"d":"83.90"},"是"]
["114140230030544","高靖博","081700","化学工程与技术","硕博连读",null,null,{"v":83.6,"d":"83.60"},null,{"v":83.6,"d":"83.60"},"是"]
["114140230030580","王明龙","081700","化学工程与技术","硕博连读",null,null,{"v":78.2666666666667,"d":"78.27"},null,{"v":78.2666666666667,"d":"78.27"},"否"]
["114140230030601","李建","081700","化学工程与技术","硕博连读",null,null,{"v":77.2571428571429,"d":"77.26"},null,{"v":77.2571428571429,"d":"77.26"},"否"]
["114140230030635","司道润","081700","化学工程与技术","硕博连读",null,null,{"v":71.9,"d":"71.90"},null,{"v":71.9,"d":"71.90"},"否"]
[]
["考生编号","姓名","专业代码","专业名称","考试方式","材料审核成绩","笔试成绩","面试成绩","复试成绩","复试总成绩","是否拟录取"]
[{"$f":"VLOOKUP(B24:B39,[1]yxcs24135403!$A$2:$B$88,2,0)","v":"114140110030058"},"黄宇","085800","能源动力","申请考核制",90,80,{"v":88,"d":"88.00"},{"v":68.8,"d":"68.80"},{"v":86.8,"d":"86.80"},"是"]
[{"$f":"VLOOKUP(B25:B39,[1]yxcs24135403!$A$2:$B$88,2,0)","v":"114140110030368"},"常大山","085800","能源动力","申请考核制",75,90,88.48,{"v":71.088,"d":"71.09"},{"v":86.088,"d":"86.09"},"是"]
[{"$f":"VLOOKUP(B26:B41,[1]yxcs24135403!$A$2:$B$88,2,0)","v":"114140110030335"},"孙富伟","085800","能源动力","申请考核制",90,75,{"v":87.6,"d":"87.60"},67.56,85.56,"是"]
[{"$f":"VLOOKUP(B27:B27,[1]yxcs24135403!$A$2:$B$88,2,0)","v":"114140230030583"},"刘启","085800","能源动力","硕博连读",null,null,81.88,null,81.88,"是"]
[{"$f":"VLOOKUP(B28:B44,[1]yxcs24135403!$A$2:$B$88,2,0)","v":"114140110030401"},"贺娇","085800","能源动力","申请考核制",70,70,88.72,{"v":67.232,"d":"67.23"},{"v":81.232,"d":"81.23"},"是"]
[{"$f":"VLOOKUP(B29:B38,[1]yxcs24135403!$A$2:$B$88,2,0)","v":"114140110030440"},"李积升","085800","能源动力","申请考核制",91,70,79.12,{"v":61.472,"d":"61.47"},{"v":79.672,"d":"79.67"},"候补"]
[{"$f":"VLOOKUP(B30:B45,[1]yxcs24135403!$A$2:$B$88,2,0)","v":"114140110030215"},"夏志增","085800","能源动力","申请考核制",90,90,69.64,{"v":59.784,"d":"59.78"},{"v":77.784,"d":"77.78"},"否"]
[{"$f":"VLOOKUP(B31:B47,[1]yxcs24135403!$A$2:$B$88,2,0)","v":"114140110030277"},"黄起中","085800","能源动力","申请考核制",85,75,68.32,{"v":55.992,"d":"55.99"},{"v":72.992,"d":"72.99"},"否"]
[]
[]
["备注：在导师招生指标范围内，如果排名靠前的考生放弃或失去拟录取资格，导师有权在候补考生中择优录取。"]

{"sheet":"工业催化组","index":2,"n_rows":18,"n_cols":11,"rows_kept":18,"merged":[[0,0,0,10]]}
["2021年化工学院-工业催化组博士研究生复试结果公示"]
["考生编号","姓名","专业代码","专业名称","考试方式","材料审核成绩","笔试成绩","面试成绩","复试成绩","复试总成绩","是否拟录取"]
[{"$f":"VLOOKUP(B3:B18,[2]yxcs24135403!$A$2:$B$88,2,0)","v":"114140110030127"},"陈诚","081700","化学工程与技术","申请考核制",88,88,84.88,{"v":68.528,"d":"68.53"},{"v":86.128,"d":"86.13"},"是"]
[{"$f":"VLOOKUP(B4:B20,[2]yxcs24135403!$A$2:$B$88,2,0)","v":"114140110030230"},"刘萌","081700","化学工程与技术","申请考核制",90,75,{"v":86,"d":"86.00"},{"v":66.6,"d":"66.60"},{"v":84.6,"d":"84.60"},"是"]
[{"$f":"VLOOKUP(B5:B20,[2]yxcs24135403!$A$2:$B$88,2,0)","v":"114140110030082"},"丁中振","081700","化学工程与技术","申请考核制",89,80,{"v":82.2,"d":"82.20"},65.32,83.12,"是"]
[{"$f":"VLOOKUP(B6:B22,[2]yxcs24135403!$A$2:$B$88,2,0)","v":"114140110030283"},"马跃","081700","化学工程与技术","申请考核制",84,88,{"v":80.6,"d":"80.60"},65.96,82.76,"是"]
[{"$f":"VLOOKUP(B7:B21,[2]yxcs24135403!$A$2:$B$88,2,0)","v":"114140110030081"},"刘琦","081700","化学工程与技术","申请考核制",88,60,87.64,{"v":64.584,"d":"64.58"},{"v":82.184,"d":"82.18"},"是"]
[{"$f":"VLOOKUP(B8:B22,[2]yxcs24135403!$A$2:$B$88,2,0)","v":"114140110030476"},"李明轩","081700","化学工程与技术","申请考核制",89,90,71.96,{"v":61.176,"d":"61.18"},{"v":78.976,"d":"78.98"},"否"]
[{"$f":"VLOOKUP(B9:B19,[2]yxcs24135403!$A$2:$B$88,2,0)","v":"114140110030366"},"李尚竟","081700","化学工程与技术","申请考核制",93,58,72.52,{"v":55.112,"d":"55.11"},{"v":73.712,"d":"73.71"},"否"]
[]
["考生编号","姓名","专业代码","专业名称","考试方式","材料审核成绩","笔试成绩","面试成绩","复试成绩","复试总成绩","是否拟录取"]
[{"$f":"VLOOKUP(B12:B29,[2]yxcs24135403!$A$2:$B$88,2,0)","v":"114140230030519"},"栾孟坤","081700","化学工程与技术","硕博连读",null,null,89.12,null,89.12,"是"]
[{"$f":"VLOOKUP(B13:B30,[2]yxcs24135403!$A$2:$B$88,2,0)","v":"114140230030525"},"曹轶华","081700","化学工程与技术","硕博连读",null,null,81.92,null,81.92,"是"]
[]
["考生编号","姓名","专业代码","专业名称","考试方式","材料审核成绩","笔试成绩","面试成绩","复试成绩","复试总成绩","是否拟录取"]
[{"$f":"VLOOKUP(B16:B36,[2]yxcs24135403!$A$2:$B$88,2,0)","v":"114140110030040"},"宋琪","085800","能源动力","申请考核制",95,85,{"v":88.4,"d":"88.40"},70.04,89.04,"是"]
[{"$f":"VLOOKUP(B17:B37,[2]yxcs24135403!$A$2:$B$88,2,0)","v":"114140110030383"},"肖鹏","085800","能源动力","申请考核制",86,70,{"v":85,"d":"85.00"},{"v":65,"d":"65.00"},{"v":82.2,"d":"82.20"},"是"]
[{"$f":"VLOOKUP(B18:B38,[2]yxcs24135403!$A$2:$B$88,2,0)","v":"114140110030484"},"陶金泉","085800","能源动力","申请考核制",72,83,{"v":81.3333333333333,"d":"81.33"},{"v":65.4,"d":"65.40"},{"v":79.8,"d":"79.80"},"是"]

{"sheet":"环境化工组","index":3,"n_rows":19,"n_cols":11,"rows_kept":19,"merged":[[0,0,0,10]]}
["2021年化工学院-环境化工组博士研究生复试结果公示"]
["考生编号","姓名","专业代码","专业名称","考试方式","材料审核成绩","笔试成绩","面试成绩","复试成绩","复试总成绩","是否拟录取"]
["114140110030007","回天力","081700","化学工程与技术","申请考核制",81,90,93.8,74.28,90.48,"是"]
["114140110030212","姜刘杉","081700","化学工程与技术","申请考核制",87,85,92,{"v":72.2,"d":"72.20"},{"v":89.6,"d":"89.60"},"是"]
["114140110030388","关俊杰","081700","化学工程与技术","申请考核制",89,80,92.5,{"v":71.5,"d":"71.50"},{"v":89.3,"d":"89.30"},"是"]
["114140110030236","寇悦","081700","化学工程与技术","申请考核制",74,90,92.28,{"v":73.368,"d":"73.37"},{"v":88.168,"d":"88.17"},"是"]
["114140110030147","郑逸","0817J4","能源环境科学与工程","申请考核制",87,75,88.8,68.28,85.68,"是"]
["114140110030057","付信格","081700","化学工程与技术","申请考核制",89,75,86.3,66.78,84.58,"是"]
["114140110030478","王陇豫","081700","化学工程与技术","申请考核制",67,71,84.2,64.72,78.12,"是"]
["114140110030397","蒋郑峰","081700","化学工程与技术","申请考核制",65,80,76.7,62.02,75.02,"否"]
[]
["考生编号","姓名","专业代码","专业名称","考试方式","材料审核成绩","笔试成绩","面试成绩","复试成绩","复试总成绩","是否拟录取"]
["114140230030600","岳黎平","081700","化学工程与技术","硕博连读",null,null,90,null,90,"是"]
["114140230030543","孔涛","081700","化学工程与技术","硕博连读",null,null,89.8,null,89.8,"是"]
[]
["考生编号","姓名","专业代码","专业名称","考试方式","材料审核成绩","笔试成绩","面试成绩","复试成绩","复试总成绩","是否拟录取"]
["114140110030176","宋佳宇","085700","资源与环境","申请考核制",88,70,88.5,{"v":67.1,"d":"67.10"},{"v":84.7,"d":"84.70"},"是"]
["114140110030350","程彬彬","085700","资源与环境","申请考核制",87,85,83.6,67.16,84.56,"是"]
["114140110030271","靳炜","085700","资源与环境","申请考核制",86,90,77.2,64.32,81.52,"是"]