{"text_format":"3","workbook":"xlsx","n_sheets":9,"sheets":["专业排名汇总表","成绩","德育基础分","德育加分 (2)","德育扣分","智育加分 (2)","智育加分汇总","文体加分 (2)","体测成绩"],"not_rendered":{"defined_names":2,"pivot_tables":1},"read":"whole","date_system":"1900"}

{"sheet":"专业排名汇总表","index":0,"n_rows":104,"n_cols":30,"rows_kept":104,"merged":[[0,0,1,0],[0,1,1,1],[0,2,1,2],[0,3,1,3],[0,4,1,4],[0,5,0,12],[0,13,0,18],[0,19,0,25],[0,26,1,26],[0,27,1,27],[0,28,1,28],[0,29,1,29]]}
["排名"," 必修课排名","学号","姓名","班级","德育成绩",{"$nulls":7},"智育成绩",{"$nulls":5},"体育成绩",{"$nulls":6},"综合测评总分","优良率","四级成绩","是否挂科"]
[{"$nulls":5},"班级互评分","辅导员打分","班级互评分×0.6","辅导员打分×0.4","德育加分","德育扣分","德育成绩","德育成绩×0.2","必修课加权平均分","选修课加权平均分","智育成绩（必修课×0.8+选修课×0.2）","智育加分","智育成绩","智育成绩×0.7","体育课成绩","锻炼成绩","体育课成绩×0.6","锻炼成绩×0.4","体育加分","体育成绩","体育成绩×0.1"]
["示例说明",{"$nulls":4},"vlookup","vlookup","公式求和","公式求和","汇总统计","汇总统计","公式求和","公式求和","vlookup","vlookup","公式求和","汇总统计","公式求和","公式求和","单独做表vlookup","vlookup","公式求和","公式求和","汇总统计","公式求和","公式求和","公式求和","vlookup","vlookup","vlookup"]
[{"$f":"RANK(AA4,AA$4:AA$104)","v":29},{"$f":"RANK(N4,N$4:N$104)","v":19},2022010364,"张姝瑶","化工22-1班",{"$f":"VLOOKUP(C:C,德育基础分!A3:D103,4,0)","v":{"v":99.8782714546561,"d":"99.8783"}},{"v":90,"d":"90.0000"},{"$f":"F4*0.6","v":{"v":59.9269628727937,"d":"59.9270"}},{"$f":"G4*0.4","v":{"v":36,"d":"36.0000"}},{"$f":"VLOOKUP(C:C,'德育加分 (2)'!C:AC,27,0)","v":{"v":0.5,"d":"0.5000"}},{"$f":"VLOOKUP(C:C,德育扣分!A2:F103,6,0)","v":{"v":0,"d":"0.0000"}},{"$f":"H4+I4+J4-K4","v":{"v":96.4269628727937,"d":"96.4270"}},{"$f":"L4*0.2","v":{"v":19.2853925745587,"d":"19.2854"}},{"$f":"VLOOKUP(C:C,成绩!B1:D102,3,0)","v":{"v":84.2266666666667,"d":"84.2267"}},{"$f":"VLOOKUP(C:C,成绩!B:E,4,0)","v":{"v":82.5,"d":"82.5000"}},{"$f":"N4*0.8+O4*0.2","v":{"v":83.8813333333333,"d":"83.8813"}},{"$f":"VLOOKUP(D:D,智育加分汇总!F:G,2,0)","v":{"v":4,"d":"4.0000"}},{"$f":"Q4+P4","v":{"v":87.8813333333333,"d":"87.8813"}},{"$f":"R4*0.7","v":{"v":61.5169333333333,"d":"61.5169"}},{"$f":"VLOOKUP(C:C,成绩!B:F,5,0)","v":{"v":90,"d":"90.0000"}},{"v":100,"d":"100.0000"},{"$f":"T4*0.6","v":{"v":54,"d":"54.0000"}},{"$f":"U4*0.4","v":{"v":40,"d":"40.0000"}},{"$f":"VLOOKUP(C:C,'文体加分 (2)'!C2:O167,13,0)","v":{"v":0,"d":"0.0000"}},{"$f":"V4+W4+X4","v":{"v":94,"d":"94.0000"}},{"$f":"Y4*0.1","v":{"v":9.4,"d":"9.4000"}},{"$f":"Z4+S4+M4","v":{"v":90.2023259078921,"d":"90.2023"}},{"$f":"VLOOKUP(C:C,成绩!B:G,6,0)","v":{"v":0.789473684210526,"d":"78.9474%"}},547,{"$f":"VLOOKUP(C:C,成绩!B:H,7,0)","v":0}]
[{"$f":"RANK(AA5,AA$4:AA$104)","v":81},{"$f":"RANK(N5,N$4:N$104)","v":97},2022010367,"周芹","化工22-1班",{"$f":"VLOOKUP(C:C,德育基础分!A4:D104,4,0)","v":{"v":99.9087035909921,"d":"99.9087"}},{"v":90,"d":"90.0000"},{"$f":"F5*0.6","v":{"v":59.9452221545952,"d":"59.9452"}},{"$f":"G5*0.4","v":{"v":36,"d":"36.0000"}},{"$f":"VLOOKUP(C:C,'德育加分 (2)'!C:AC,27,0)","v":{"v":6.83,"d":"6.8300"}},{"$f":"VLOOKUP(C:C,德育扣分!A3:F104,6,0)","v":{"v":0,"d":"0.0000"}},{"$f":"H5+I5+J5-K5","v":{"v":102.775222154595,"d":"102.7752"}},{"$f":"L5*0.2","v":{"v":20.5550444309191,"d":"20.5550"}},{"$f":"VLOOKUP(C:C,成绩!B2:D103,3,0)","v":{"v":65.641975308642,"d":"65.6420"}},{"$f":"VLOOKUP(C:C,成绩!B:E,4,0)","v":{"v":89,"d":"89.0000"}},{"$f":"N5*0.8+O5*0.2","v":{"v":70.3135802469136,"d":"70.3136"}},{"v":0,"d":"0.0000"},{"$f":"Q5+P5","v":{"v":70.3135802469136,"d":"70.3136"}},{"$f":"R5*0.7","v":{"v":49.2195061728395,"d":"49.2195"}},{"$f":"VLOOKUP(C:C,成绩!B:F,5,0)","v":{"v":92.5,"d":"92.5000"}},{"v":100,"d":"100.0000"},{"v":55.5,"d":"55.5000"},{"v":40,"d":"40.0000"},{"$f":"VLOOKUP(C:C,'文体加分 (2)'!C3:O168,13,0)","v":{"v":0,"d":"0.0000"}},{"$f":"V5+W5+X5","v":{"v":95.5,"d":"95.5000"}},{"$f":"Y5*0.1","v":{"v":9.55,"d":"9.5500"}},{"$f":"Z5+S5+M5","v":{"v":79.3245506037586,"d":"79.3246"}},{"$f":"VLOOKUP(C:C,成绩!B:G,6,0)","v":{"v":0.35,"d":"35.0000%"}},570,{"$f":"VLOOKUP(C:C,成绩!B:H,7,0)","v":4}]
[46,24,2022010369,"李越","化工22-1班",{"$f":"VLOOKUP(C:C,德育基础分!A5:D105,4,0)","v":{"v":99.8782714546561,"d":"99.8783"}},{"v":90,"d":"90.0000"},{"v":59.9269628727937,"d":"59.9270"},{"v":36,"d":"36.0000"},{"$f":"VLOOKUP(C:C,'德育加分 (2)'!C:AC,27,0)","v":{"v":0.5,"d":"0.5000"}},{"$f":"VLOOKUP(C:C,德育扣分!A4:F105,6,0)","v":{"v":0,"d":"0.0000"}},{"v":96.4269628727937,"d":"96.4270"},{"v":19.2853925745587,"d":"19.2854"},{"$f":"VLOOKUP(C:C,成绩!B3:D104,3,0)","v":{"v":83.6266666666667,"d":"83.6267"}},{"$f":"VLOOKUP(C:C,成绩!B:E,4,0)","v":{"v":78.5,"d":"78.5000"}},{"v":82.6013333333333,"d":"82.6013"},{"v":0,"d":"0.0000"},{"v":82.6013333333333,"d":"82.6013"},{"v":57.8209333333333,"d":"57.8209"},{"$f":"VLOOKUP(C:C,成绩!B:F,5,0)","v":{"v":90,"d":"90.0000"}},{"v":100,"d":"100.0000"},{"v":54,"d":"54.0000"},{"v":40,"d":"40.0000"},{"$f":"VLOOKUP(C:C,'文体加分 (2)'!C4:O169,13,0)","v":{"v":0,"d":"0.0000"}},{"v":94,"d":"94.0000"},{"v":9.4,"d":"9.4000"},{"v":86.5063259078921,"d":"86.5063"},{"$f":"VLOOKUP(C:C,成绩!B:G,6,0)","v":{"v":0.736842105263158,"d":"73.6842%"}},"未通过",{"$f":"VLOOKUP(C:C,成绩!B:H,7,0)","v":0}]
[89,79,2022010370,"马海霞","化工22-1班",{"$f":"VLOOKUP(C:C,德育基础分!A6:D106,4,0)","v":{"v":99.8478393183201,"d":"99.8478"}},{"v":90,"d":"90.0000"},{"v":59.9087035909921,"d":"59.9087"},{"v":36,"d":"36.0000"},{"$f":"VLOOKUP(C:C,'德育加分 (2)'!C:AC,27,0)","v":{"v":0.5,"d":"0.5000"}},{"$f":"VLOOKUP(C:C,德育扣分!A5:F106,6,0)","v":{"v":0,"d":"0.0000"}},{"v":96.4087035909921,"d":"96.4087"},{"v":19.2817407181984,"d":"19.2817"},{"$f":"VLOOKUP(C:C,成绩!B4:D105,3,0)","v":{"v":70.8390804597701,"d":"70.8391"}},{"$f":"VLOOKUP(C:C,成绩!B:E,4,0)","v":{"v":72,"d":"72.0000"}},{"v":71.0712643678161,"d":"71.0713"},{"v":0,"d":"0.0000"},{"v":71.0712643678161,"d":"71.0713"},{"v":49.7498850574713,"d":"49.7499"},{"$f":"VLOOKUP(C:C,成绩!B:F,5,0)","v":{"v":75,"d":"75.0000"}},{"v":100,"d":"100.0000"},{"v":45,"d":"45.0000"},{"v":40,"d":"40.0000"},{"$f":"VLOOKUP(C:C,'文体加分 (2)'!C5:O170,13,0)","v":{"v":0,"d":"0.0000"}},{"v":85,"d":"85.0000"},{"v":8.5,"d":"8.5000"},{"v":77.5316257756697,"d":"77.5316"},{"$f":"VLOOKUP(C:C,成绩!B:G,6,0)","v":{"v":0.285714285714286,"d":"28.5714%"}},"未通过",{"$f":"VLOOKUP(C:C,成绩!B:H,7,0)","v":0}]
[41,37,2022010371,"何丽鸿","化工22-1班",{"$f":"VLOOKUP(C:C,德育基础分!A7:D107,4,0)","v":{"v":99.8478393183201,"d":"99.8478"}},{"v":90,"d":"90.0000"},{"v":59.9087035909921,"d":"59.9087"},{"v":36,"d":"36.0000"},{"$f":"VLOOKUP(C:C,'德育加分 (2)'!C:AC,27,0)","v":{"v":3.5,"d":"3.5000"}},{"$f":"VLOOKUP(C:C,德育扣分!A6:F107,6,0)","v":{"v":0,"d":"0.0000"}},{"v":99.4087035909921,"d":"99.4087"},{"v":19.8817407181984,"d":"19.8817"},{"$f":"VLOOKUP(C:C,成绩!B5:D106,3,0)","v":{"v":79.4320987654321,"d":"79.4321"}},{"$f":"VLOOKUP(C:C,成绩!B:E,4,0)","v":{"v":80.25,"d":"80.2500"}},{"v":79.5956790123457,"d":"79.5957"},{"$f":"VLOOKUP(D:D,智育加分汇总!F:G,2,0)","v":{"v":2,"d":"2.0000"}},{"v":81.5956790123457,"d":"81.5957"},{"v":57.116975308642,"d":"57.1170"},{"$f":"VLOOKUP(C:C,成绩!B:F,5,0)","v":{"v":90.5,"d":"90.5000"}},{"v":100,"d":"100.0000"},{"v":54.3,"d":"54.3000"},{"v":40,"d":"40.0000"},{"$f":"VLOOKUP(C:C,'文体加分 (2)'!C6:O171,13,0)","v":{"v":8,"d":"8.0000"}},{"v":102.3,"d":"102.3000"},{"v":10.23,"d":"10.2300"},{"v":87.2287160268404,"d":"87.2287"},{"$f":"VLOOKUP(C:C,成绩!B:G,6,0)","v":{"v":0.55,"d":"55.0000%"}},498,{"$f":"VLOOKUP(C:C,成绩!B:H,7,0)","v":0}]
[45,33,2022010372,"史佳悦","化工22-1班",{"$f":"VLOOKUP(C:C,德育基础分!A8:D108,4,0)","v":{"v":99.5435179549604,"d":"99.5435"}},{"v":90,"d":"90.0000"},{"v":59.7261107729763,"d":"59.7261"},{"v":36,"d":"36.0000"},{"$f":"VLOOKUP(C:C,'德育加分 (2)'!C:AC,27,0)","v":{"v":4.5,"d":"4.5000"}},{"$f":"VLOOKUP(C:C,德育扣分!A7:F108,6,0)","v":{"v":0,"d":"0.0000"}},{"v":100.226110772976,"d":"100.2261"},{"v":20.0452221545953,"d":"20.0452"},{"$f":"VLOOKUP(C:C,成绩!B6:D107,3,0)","v":{"v":80.0133333333333,"d":"80.0133"}},{"$f":"VLOOKUP(C:C,成绩!B:E,4,0)","v":{"v":87.3333333333333,"d":"87.3333"}},{"v":81.4773333333333,"d":"81.4773"},{"v":0,"d":"0.0000"},{"v":81.4773333333333,"d":"81.4773"},{"v":57.0341333333333,"d":"57.0341"},{"$f":"VLOOKUP(C:C,成绩!B:F,5,0)","v":{"v":87,"d":"87.0000"}},{"v":100,"d":"100.0000"},{"v":52.2,"d":"52.2000"},{"v":40,"d":"40.0000"},{"$f":"VLOOKUP(C:C,'文体加分 (2)'!C7:O172,13,0)","v":{"v":4,"d":"4.0000"}},{"v":96.2,"d":"96.2000"},{"v":9.62,"d":"9.6200"},{"v":86.6993554879286,"d":"86.6994"},{"$f":"VLOOKUP(C:C,成绩!B:G,6,0)","v":{"v":0.631578947368421,"d":"63.1579%"}},429,{"$f":"VLOOKUP(C:C,成绩!B:H,7,0)","v":0}]
[4,2,2022010373,"王晴宇","化工22-1班",{"$f":"VLOOKUP(C:C,德育基础分!A9:D109,4,0)","v":{"v":99.8174071819842,"d":"99.8174"}},{"v":90,"d":"90.0000"},{"v":59.8904443091905,"d":"59.8904"},{"v":36,"d":"36.0000"},{"$f":"VLOOKUP(C:C,'德育加分 (2)'!C:AC,27,0)","v":{"v":9.37,"d":"9.3700"}},{"$f":"VLOOKUP(C:C,德育扣分!A8:F109,6,0)","v":{"v":0,"d":"0.0000"}},{"v":105.260444309191,"d":"105.2604"},{"v":21.0520888618381,"d":"21.0521"},{"$f":"VLOOKUP(C:C,成绩!B7:D108,3,0)","v":{"v":88.52,"d":"88.5200"}},{"$f":"VLOOKUP(C:C,成绩!B:E,4,0)","v":{"v":90.6666666666667,"d":"90.6667"}},{"v":88.9493333333333,"d":"88.9493"},{"$f":"VLOOKUP(D:D,智育加分汇总!F:G,2,0)","v":{"v":31.8333333333333,"d":"31.8333"}},{"v":120.782666666667,"d":"120.7827"},{"v":84.5478666666666,"d":"84.5479"},{"$f":"VLOOKUP(C:C,成绩!B:F,5,0)","v":{"v":92,"d":"92.0000"}},{"v":100,"d":"100.0000"},{"v":55.2,"d":"55.2000"},{"v":40,"d":"40.0000"},{"$f":"VLOOKUP(C:C,'文体加分 (2)'!C8:O173,13,0)","v":{"v":0,"d":"0.0000"}},{"v":95.2,"d":"95.2000"},{"v":9.52,"d":"9.5200"},{"v":115.119955528505,"d":"115.1200"},{"$f":"VLOOKUP(C:C,成绩!B:G,6,0)","v":{"v":0.894736842105263,"d":"89.4737%"}},568,{"$f":"VLOOKUP(C:C,成绩!B:H,7,0)","v":0}]
{"$rows_left_out":95}
{"sheet":"成绩","index":1,"n_rows":102,"n_cols":8,"rows_kept":102}
["序号","学号","姓名","必修课加权平均分","选修课加权平均分","体育课成绩","必修课优良率","挂科数"]
[1,2022010364,"张姝瑶",{"v":84.2266666666667,"d":"84.23"},{"v":82.5,"d":"82.50"},{"v":90,"d":"90.00"},{"v":0.789473684210526,"d":"78.95%"},0]
[2,2022010367,"周芹",{"v":65.641975308642,"d":"65.64"},{"v":89,"d":"89.00"},{"v":92.5,"d":"92.50"},{"v":0.35,"d":"35.00%"},4]
[3,2022010369,"李越",{"v":83.6266666666667,"d":"83.63"},{"v":78.5,"d":"78.50"},{"v":90,"d":"90.00"},{"v":0.736842105263158,"d":"73.68%"},0]
[4,2022010370,"马海霞",{"v":70.8390804597701,"d":"70.84"},{"v":72,"d":"72.00"},{"v":75,"d":"75.00"},{"v":0.285714285714286,"d":"28.57%"},0]
[5,2022010371,"何丽鸿",{"v":79.4320987654321,"d":"79.43"},80.25,{"v":90.5,"d":"90.50"},{"v":0.55,"d":"55.00%"},0]
[6,2022010372,"史佳悦",{"v":80.0133333333333,"d":"80.01"},{"v":87.3333333333333,"d":"87.33"},{"v":87,"d":"87.00"},{"v":0.631578947368421,"d":"63.16%"},0]
[7,2022010373,"王晴宇",88.52,{"v":90.6666666666667,"d":"90.67"},{"v":92,"d":"92.00"},{"v":0.894736842105263,"d":"89.47%"},0]
[8,2022010374,"袁佳怡",{"v":88.0266666666667,"d":"88.03"},{"v":86.5,"d":"86.50"},{"v":95.5,"d":"95.50"},{"v":0.947368421052632,"d":"94.74%"},0]
[9,2022012311,"布威麦尔耶姆·麦麦提图尔荪",{"v":72.3066666666667,"d":"72.31"},{"v":78,"d":"78.00"},{"v":84,"d":"84.00"},{"v":0.421052631578947,"d":"42.11%"},1]
{"$rows_left_out":93}
{"sheet":"德育基础分","index":2,"n_rows":103,"n_cols":5,"rows_kept":103,"merged":[[0,0,0,4]]}
["辅导员打分"]
["学号","姓名","班级","互评分","辅导员打分"]
[2022010364,"张姝瑶","化工22-1班",{"v":99.8782714546561,"d":"99.88"},90]
[2022010367,"周芹","化工22-1班",{"v":99.9087035909921,"d":"99.91"},90]
[2022010369,"李越","化工22-1班",{"v":99.8782714546561,"d":"99.88"},90]
[2022010370,"马海霞","化工22-1班",{"v":99.8478393183201,"d":"99.85"},90]
[2022010371,"何丽鸿","化工22-1班",{"v":99.8478393183201,"d":"99.85"},90]
[2022010372,"史佳悦","化工22-1班",{"v":99.5435179549604,"d":"99.54"},90]
[2022010373,"王晴宇","化工22-1班",{"v":99.8174071819842,"d":"99.82"},90]
[2022010374,"袁佳怡","化工22-1班",{"v":99.8478393183201,"d":"99.85"},90]
{"$rows_left_out":94}
{"sheet":"德育加分 (2)","index":3,"n_rows":167,"n_cols":29,"rows_kept":167,"merged":[[0,0,2,0],[0,1,2,1],[0,2,2,2],[0,3,2,3],[0,4,0,10],[0,11,0,17],[0,18,0,22],[0,23,0,27],[0,28,2,28],[1,4,1,6],[1,7,1,9],[1,10,2,10],[1,11,1,16],[1,17,2,17],[1,18,1,19],[1,20,1,21],[1,22,2,22],[1,23,1,24],[1,25,1,26],[1,27,2,27]]}
["序号","班级","学号","姓名","学生团体及班级干部",{"$nulls":6},"社会实践获奖（参与奖、优秀奖不加分）2023年的",{"$nulls":6},"大型活动",{"$nulls":4},"荣誉称号",{"$nulls":4},"德育加分求和"]
[{"$nulls":4},"第一项",null,null,"第二项×0.2",null,null,"总计","社会实践",{"$nulls":5},"总计","第一项",null,"第二项",null,"总计","第一项",null,"第二项",null,"总计"]
[{"$nulls":4},"项目","原始加分","校院级折合（不填）","项目","原始加分","校院级折合（不填）",null,"第一项目","是否为队长","加分","第二项目","是否为队长","加分（×0.5）",null,"项目","加分","项目","加分",null,"项目","加分","项目","加分"]
[1,"化工22-1班",2022010364,"张姝瑶",{"$nulls":6},{"$f":"G4+J4*0.2","v":0},{"$nulls":6},{"$f":"N4+Q4*0.5","v":0},{"$nulls":4},{"$f":"T4+V4","v":0},"示范班集体",0.5,null,null,{"$f":"Y4+AA4","v":0.5},{"$f":"K4+R4+W4+AB4","v":0.5}]
[2,"化工22-1班",2022010367,"周芹","校红十字会血液部部长",8,5.33,"化工22-1副班长",5,5,6.33,{"$nulls":6},0,{"$nulls":4},0,"示范班集体",0.5,null,null,0.5,6.83]
[3,"化工22-1班",2022010369,"李越",{"$nulls":6},0,{"$nulls":6},0,{"$nulls":4},0,"示范班集体",0.5,null,null,0.5,0.5]
[4,"化工22-1班",2022010370,"马海霞",{"$nulls":6},0,{"$nulls":6},0,{"$nulls":4},0,"示范班集体",0.5,null,null,0.5,0.5]
[5,"化工22-1班",2022010371,"何丽鸿","有机实验课代表",3,3,{"$nulls":3},3,{"$nulls":6},0,{"$nulls":4},0,"示范班集体",0.5,null,null,0.5,3.5]
[6,"化工22-1班",2022010372,"史佳悦","化工22-1班宣传委员",4,4,{"$nulls":3},4,{"$nulls":6},0,{"$nulls":4},0,"示范班集体",0.5,null,null,0.5,4.5]
[7,"化工22-1班",2022010373,"王晴宇","校青年实践创新中心创新部部长",10,6.67,"化工22-1班团支书",6,6,7.87,"2023红色“1+1”校三等奖","否",1,{"$nulls":3},1,{"$nulls":4},0,"示范班集体",0.5,null,null,0.5,9.37]
{"$rows_left_out":158}
{"sheet":"德育扣分","index":4,"n_rows":103,"n_cols":6,"rows_kept":103,"merged":[[0,0,0,5]]}
["德育扣分"]
["学号","姓名","班级","翘课学时","通报批评","德育扣分"]
[2022010364,"张姝瑶","化工22-1班"]
[2022010367,"周芹","化工22-1班"]
[2022010369,"李越","化工22-1班"]
[2022010370,"马海霞","化工22-1班"]
[2022010371,"何丽鸿","化工22-1班"]
[2022010372,"史佳悦","化工22-1班"]
[2022010373,"王晴宇","化工22-1班"]
[2022010374,"袁佳怡","化工22-1班"]
{"$rows_left_out":94}
{"sheet":"智育加分 (2)","index":5,"n_rows":286,"n_cols":13,"rows_kept":286,"merged":[[0,4,0,10],[2,0,6,0],[154,0,156,0],[158,0,160,0],[162,0,164,0],[166,0,167,0],[169,0,170,0],[172,0,173,0],[175,0,176,0],[184,0,186,0],[188,0,189,0],[191,0,201,0],[206,0,207,0]]}
[{"$nulls":4},"智育加分"]
["序号","学号","姓名","班级","竞赛名称","主办单位","竞赛级别","获奖等级","是否为团队项目","若为团队竞赛，填写团队成员；若为个人竞赛，则无需填写","加分(辅导员填写)"]
["　实例",2018010615,"张山","能化18-1班","2020年第十二届北京市大学生化学实验竞赛","北京化工大学化学实验竞赛组委会","省部级","二等奖","否","　"]
[null,2018010615,"张山","能化18-1班","2020年中国石油大学（北京）第十二届北京市大学生化学实验竞赛校内选拔赛","中国石油大学（北京）化学爱好者协会","校级","一等奖","否","　"]
[null,2018010615,"张山","能化18-1班","2020年第十届亚太地区大学生数学建模竞赛","北京图象图形学学会","省部级","三等奖","是","张山，李四，王五"]
[null,"　","　","　","第十二届全国大学生化学实验邀请赛校赛","中国石油大学（北京）","国家级","三等奖","否","李四、王五、张山、赵六"]
[null,"　","　","　","　","　","　","　","　","合计"]
[null,2022010491,"张志彬","能化22-2班","青创北京\"挑战杯\"首都大学生课外学术科技作品竞赛","北京市教育委员会","省部级","一等奖","是","张志彬  吴忆  孟婧涵  王晴宇  曹炜曼  张润霞  孙涵  叶海宇",{"v":5.33333333333333,"d":"5.33"}]
[null,2022010491,"张志彬",null,"“创青春”碳中和创新创业大赛","“创青春”中国青年碳中和创新创业大赛组委会","国家级","鼓励奖","是","郭飞扬、吴忆、张伊蕊、张志彬、齐嘉莹、钮缨雪、李佳蕊",{"v":2.5,"d":"2.50"}]
[null,2022010491,"张志彬",null,"2024年第十七届全国大学生节能减排社会实践与科技竞赛","中国石油大学（北京）","校级","三等奖","是","吴忆,左丁伟,张志彬,孟婧涵,曹炜曼,周一凡,霍宇欣",{"v":1.33333333333333,"d":"1.33"}]
{"$rows_left_out":277}
{"sheet":"智育加分汇总","index":6,"n_rows":186,"n_cols":7,"rows_kept":186}
["学号","姓名","加分(辅导员填写)"]
[2022010491,"张志彬",{"v":5.33333333333333,"d":"5.33"},null,null,"姓名","求和项：加分(辅导员填写)"]
[2022010491,"张志彬",{"v":2.5,"d":"2.50"},null,null,"金立民",11]
[2022010491,"张志彬",{"v":1.33333333333333,"d":"1.33"},null,null,"江锦欣",21]
[2022010493,"付锦依",{"v":4.5,"d":"4.50"},null,null,"陈方旭",2]
[2022010493,"付锦依",{"v":5,"d":"5.00"},null,null,"陈飞月",7]
[2022010494,"付锦依",{"v":2,"d":"2.00"},null,null,"陈禾婕",10.6666666666667]
[2022010522,"熊俊程",{"v":2,"d":"2.00"},null,null,"白兆",6.5]
[null,"熊俊程",{"v":2,"d":"2.00"},null,null,"陈伟玄",9]
[2022010496,"张鑫",{"v":2,"d":"2.00"},null,null,"陈心",4]
{"$rows_left_out":177}
{"sheet":"文体加分 (2)","index":7,"n_rows":167,"n_cols":15,"rows_kept":167,"merged":[[0,0,0,14],[1,0,2,0],[1,1,2,1],[1,2,2,2],[1,3,2,3],[1,4,1,7],[1,8,2,8],[1,9,1,12],[1,13,2,13],[1,14,2,14]]}
["文体加分汇总"]
["序号","班级","学号","姓名","文艺活动加分",{"$nulls":3},"合计","体育活动加分",{"$nulls":3},"合计","总计"]
[{"$nulls":4},"项目","加分","项目","加分",null,"项目","加分","项目","加分"]
[1,"化工22-1班",2022010364,"张姝瑶",{"$nulls":4},{"$f":"F4+H4","v":0},{"$nulls":4},{"$f":"K4+M4","v":0},{"$f":"I4+N4","v":0}]
[2,"化工22-1班",2022010367,"周芹",{"$nulls":4},0,{"$nulls":4},0,0]
[3,"化工22-1班",2022010369,"李越",{"$nulls":4},0,{"$nulls":4},0,0]
[4,"化工22-1班",2022010370,"马海霞",{"$nulls":4},0,{"$nulls":4},0,0]
[5,"化工22-1班",2022010371,"何丽鸿",{"$nulls":4},0,"第一届石油杯毽绳比赛女子4*30秒双摇跳（接力第二名）",8,null,null,8,8]
[6,"化工22-1班",2022010372,"史佳悦","2023年学生资助诚信教育主题活动校级三等奖",4,null,null,4,{"$nulls":4},0,4]
[7,"化工22-1班",2022010373,"王晴宇",{"$nulls":4},0,{"$nulls":4},0,0]
{"$rows_left_out":158}
{"sheet":"体测成绩","index":8,"n_rows":281,"n_cols":17,"rows_kept":281}
["年级","院系","行政班级","学籍号","姓名","性别","备注","身高","体重","肺活量","50米跑","立定跳远","坐位体前屈","800米/1000米","仰卧起坐/引体向上","总分","等级"]
[2022,"化学工程与环境学院","化工22-1班",2022010100,"智玉轩","女",null,154,61.7,3293,8,176,13.4,"3'43''",44,80.2,"良好"]
[2022,"化学工程与环境学院","化工22-1班",2022010364,"张姝瑶","女",null,161,45.6,3340,8.9,158,14.5,"3'52''",36,79.1,"及格"]
[2022,"化学工程与环境学院","化工22-1班",2022010367,"周芹","女",null,152,45.7,3164,7.9,182,14.4,"3'36''",37,84,"良好"]
[2022,"化学工程与环境学院","化工22-1班",2022010369,"李越","女",null,159,54.2,2879,7.7,187,23.1,"4'00''",37,82.8,"良好"]
[2022,"化学工程与环境学院","化工22-1班",2022010370,"马海霞","女","免测","暂无","暂无","暂无","暂无","暂无","暂无","暂无","暂无",60,"免测"]
[2022,"化学工程与环境学院","化工22-1班",2022010371,"何丽鸿","女",null,158.5,54.1,3610,8.2,184,12.1,"4'11''",43,82,"良好"]
[2022,"化学工程与环境学院","化工22-1班",2022010372,"史佳悦","女",null,164,50.1,3030,8.6,172,3.4,"4'34''",33,70.2,"及格"]
[2022,"化学工程与环境学院","化工22-1班",2022010373,"王晴宇","女",null,162.5,58,3337,8.6,165,21,"3'46''",20,77.6,"及格"]
[2022,"化学工程与环境学院","化工22-1班",2022010374,"袁佳怡","女",null,165.5,61.9,3382,8.4,181,19.3,"3'53''",33,82.7,"良好"]
{"$rows_left_out":271}