{"text_format":"3","workbook":"xlsx","n_sheets":2,"sheets":["本科生组","研究生组"],"not_rendered":{"external_links":2},"read":"whole","date_system":"1900"}

{"sheet":"本科生组","index":0,"n_rows":47,"n_cols":8,"rows_kept":47}
["序号","编号","作品类别","组别","组内排名","校赛奖项","是否推荐北京市","备注"]
[1,"ECC-2025-08517","调研与创新创业类","本科生A组",1,"校赛一等奖",{"$f":"VLOOKUP(B2,[1]本科生推荐北京市!$D:$H,5,FALSE)","v":"推荐北京市答辩"}]
[2,"ECC-2025-05627","调研与创新创业类","本科生A组",2,"校赛一等奖",{"$f":"VLOOKUP(B3,[1]本科生推荐北京市!$D:$H,5,FALSE)","v":"推荐北京市答辩"}]
[3,"ECC-2025-04654","调研与创新创业类","本科生A组",3,"校赛一等奖",{"$f":"VLOOKUP(B4,[1]本科生推荐北京市!$D:$H,5,FALSE)","v":"推荐北京市答辩"}]
[4,"ECC-2025-05667","泛能源大数据类","本科生B组",1,"校赛一等奖",{"$f":"VLOOKUP(B5,[1]本科生推荐北京市!$D:$H,5,FALSE)","v":"推荐北京市答辩"}]
[5,"ECC-2025-10266","泛能源大数据类","本科生B组",2,"校赛一等奖",{"$f":"VLOOKUP(B6,[1]本科生推荐北京市!$D:$H,5,FALSE)","v":"推荐北京市答辩"}]
[6,"ECC-2025-06889","泛能源大数据-调研与创新创业类","本科生B组",3,"校赛一等奖",{"$f":"VLOOKUP(B7,[1]本科生推荐北京市!$D:$H,5,FALSE)","v":"推荐北京市答辩"}]
[7,"ECC-2025-20737","能源经济类","本科生C组",1,"校赛一等奖",{"$f":"VLOOKUP(B8,[1]本科生推荐北京市!$D:$H,5,FALSE)","v":"推荐北京市答辩"}]
[8,"ECC-2025-10912","能源经济类","本科生C组",2,"校赛一等奖",{"$f":"VLOOKUP(B9,[1]本科生推荐北京市!$D:$H,5,FALSE)","v":"推荐北京市答辩"}]
[9,"ECC-2025-09028","能源经济类","本科生C组",3,"校赛一等奖",{"$f":"VLOOKUP(B10,[1]本科生推荐北京市!$D:$H,5,FALSE)","v":"推荐北京市答辩"}]
[10,"ECC-2025-05114","调研与创新创业类","本科生A组",4,"校赛二等奖",{"$f":"VLOOKUP(B11,[1]本科生推荐北京市!$D:$H,5,FALSE)","v":"推荐北京市答辩"}]
[11,"ECC-2025-03992","调研与创新创业类","本科生A组",5,"校赛二等奖",{"$f":"VLOOKUP(B12,[1]本科生推荐北京市!$D:$H,5,FALSE)","v":"推荐北京市答辩"}]
[12,"ECC-2025-10355","调研与创新创业类","本科生A组",6,"校赛二等奖",{"$f":"VLOOKUP(B13,[1]本科生推荐北京市!$D:$H,5,FALSE)","v":"推荐北京市答辩"}]
[13,"ECC-2025-00365","调研与创新创业类","本科生A组",7,"校赛二等奖",{"$f":"VLOOKUP(B14,[1]本科生推荐北京市!$D:$H,5,FALSE)","v":"推荐北京市答辩"},"复赛晋级"]
[14,"ECC-2025-10953","泛能源大数据类","本科生B组",4,"校赛二等奖",{"$f":"VLOOKUP(B15,[1]本科生推荐北京市!$D:$H,5,FALSE)","v":"推荐北京市答辩"}]
[15,"ECC-2025-10253","泛能源大数据类","本科生B组",5,"校赛二等奖",{"$f":"VLOOKUP(B16,[1]本科生推荐北京市!$D:$H,5,FALSE)","v":"推荐北京市答辩"}]
[16,"ECC-2025-08396","泛能源大数据类","本科生B组",6,"校赛二等奖",{"$f":"VLOOKUP(B17,[1]本科生推荐北京市!$D:$H,5,FALSE)","v":"推荐北京市答辩"}]
[17,"ECC-2025-01146","能源金融与管理类","本科生B组",7,"校赛二等奖",{"$f":"VLOOKUP(B18,[1]本科生推荐北京市!$D:$H,5,FALSE)","v":"推荐北京市答辩"},"复赛晋级"]
[18,"ECC-2025-05945","能源经济类","本科生C组",4,"校赛二等奖",{"$f":"VLOOKUP(B19,[1]本科生推荐北京市!$D:$H,5,FALSE)","v":"推荐北京市答辩"}]
[19,"ECC-2025-04596","能源经济类","本科生C组",4,"校赛二等奖",{"$f":"VLOOKUP(B20,[1]本科生推荐北京市!$D:$H,5,FALSE)","v":"推荐北京市答辩"}]
[20,"ECC-2025-21618","能源经济类","本科生C组",6,"校赛二等奖",{"$f":"VLOOKUP(B21,[1]本科生推荐北京市!$D:$H,5,FALSE)","v":"推荐北京市答辩"}]
[21,"ECC-2025-29796","调研与创新创业类","本科生A组",8,"校赛二等奖","推荐北京市三等奖"]
[22,"ECC-2025-13103","调研与创新创业类","本科生A组",9,"校赛二等奖","推荐北京市三等奖"]
[23,"ECC-2025-24415","调研与创新创业类","本科生A组",10,"校赛二等奖","推荐北京市三等奖"]
[24,"ECC-2025-30369","调研与创新创业类","本科生A组",10,"校赛二等奖","推荐北京市三等奖"]
[25,"ECC-2025-01135","能源经济类","本科生B组",8,"校赛二等奖","推荐北京市三等奖"]
[26,"ECC-2025-04666","泛能源大数据类","本科生B组",9,"校赛二等奖","推荐北京市三等奖"]
[27,"ECC-2025-25085","泛能源大数据-能源经济类","本科生B组",10,"校赛二等奖","推荐北京市三等奖"]
[28,"ECC-2025-02861","能源经济类","本科生B组",11,"校赛二等奖","推荐北京市三等奖","复赛晋级"]
[29,"ECC-2025-03329","能源经济类","本科生C组",7,"校赛二等奖","推荐北京市三等奖"]
[30,"ECC-2025-04539","能源经济类","本科生C组",8,"校赛二等奖","推荐北京市三等奖"]
[31,"ECC-2025-10169","能源经济类","本科生C组",9,"校赛二等奖","推荐北京市三等奖"]
[32,"ECC-2025-27086","能源经济类","本科生C组",10,"校赛二等奖","推荐北京市三等奖"]
[33,"ECC-2025-04660","调研与创新创业类","本科生A组",12,"校赛三等奖","否"]
[34,"ECC-2025-11664","调研与创新创业类","本科生A组",13,"校赛三等奖","否"]
[35,"ECC-2025-07243","调研与创新创业类","本科生A组",14,"校赛三等奖","否"]
[36,"ECC-2025-14674","调研与创新创业类","本科生A组",15,"校赛三等奖","否"]
[37,"ECC-2025-04718","调研与创新创业类","本科生A组",15,"校赛三等奖","否"]
[38,"ECC-2025-10335","泛能源大数据类","本科生B组",12,"校赛三等奖","否"]
[39,"ECC-2025-04674","能源金融与管理类","本科生B组",13,"校赛三等奖","否"]
[40,"ECC-2025-02875","能源经济类","本科生B组",14,"校赛三等奖","否"]
[41,"ECC-2025-08977","泛能源大数据类","本科生B组",15,"校赛三等奖","否"]
[42,"ECC-2025-11446","能源经济类","本科生C组",11,"校赛三等奖","否"]
[43,"ECC-2025-25916","能源经济类","本科生C组",12,"校赛三等奖","否"]
[44,"ECC-2025-08946","能源经济类","本科生C组",13,"校赛三等奖","否"]
[45,"ECC-2025-04751","能源经济类","本科生C组",14,"校赛三等奖","否"]
[46,"ECC-2025-04649","能源经济类","本科生C组",15,"校赛三等奖","否"]

{"sheet":"研究生组","index":1,"n_rows":21,"n_cols":8,"rows_kept":21}
["序号","编号","组别","作品类别","组别","组内排名","校赛获奖","是否推荐北京市"]
[1,"ECC-2025-00700","研究生A组","泛能源大数据类","研究生A组",1,"校赛一等奖",{"$f":"VLOOKUP(B2,[2]研究生推荐北京市赛!$D:$I,6,FALSE)","v":"北京市赛答辩名额"}]
[2,"ECC-2025-09691","研究生A组","泛能源大数据-调研与创新创业类","研究生A组",2,"校赛一等奖",{"$f":"VLOOKUP(B3,[2]研究生推荐北京市赛!$D:$I,6,FALSE)","v":"北京市赛答辩名额"}]
[3,"ECC-2025-06904","研究生B组","泛能源大数据-能源经济类","研究生B组",1,"校赛一等奖",{"$f":"VLOOKUP(B4,[2]研究生推荐北京市赛!$D:$I,6,FALSE)","v":"北京市赛答辩名额"}]
[4,"ECC-2025-09719","研究生B组","能源金融与管理类","研究生B组",2,"校赛一等奖",{"$f":"VLOOKUP(B5,[2]研究生推荐北京市赛!$D:$I,6,FALSE)","v":"北京市赛答辩名额"}]
[5,"ECC-2025-05750","研究生A组","能源经济类","研究生A组",3,"校赛二等奖",{"$f":"VLOOKUP(B6,[2]研究生推荐北京市赛!$D:$I,6,FALSE)","v":"北京市赛答辩名额"}]
[6,"ECC-2025-06577","研究生A组","能源经济类","研究生A组",4,"校赛二等奖",{"$f":"VLOOKUP(B7,[2]研究生推荐北京市赛!$D:$I,6,FALSE)","v":"北京市赛答辩名额"}]
[7,"ECC-2025-12679","研究生B组","能源经济类","研究生B组",3,"校赛二等奖",{"$f":"VLOOKUP(B8,[2]研究生推荐北京市赛!$D:$I,6,FALSE)","v":"北京市赛答辩名额"}]
[8,"ECC-2025-12541","研究生B组","能源经济类","研究生B组",4,"校赛二等奖",{"$f":"VLOOKUP(B9,[2]研究生推荐北京市赛!$D:$I,6,FALSE)","v":"北京市赛答辩名额"}]
[9,"ECC-2025-05753","研究生A组","能源经济类","研究生A组",5,"校赛二等奖","推荐北京市三等奖"]
[10,"ECC-2025-15790","研究生A组","泛能源大数据类","研究生A组",6,"校赛二等奖","推荐北京市三等奖"]
[11,"ECC-2025-10317","研究生B组","调研与创新创业类","研究生B组",5,"校赛二等奖","推荐北京市三等奖"]
[12,"ECC-2025-10868","研究生B组","泛能源大数据-调研与创新创业类","研究生B组",6,"校赛二等奖","推荐北京市三等奖"]
[13,"ECC-2025-10060","研究生B组","能源经济类","研究生B组",7,"校赛二等奖","推荐北京市三等奖"]
[14,"ECC-2025-26585","研究生A组","泛能源大数据类","研究生A组",7,"校赛三等奖","否"]
[15,"ECC-2025-05566","研究生A组","调研与创新创业类","研究生A组",8,"校赛三等奖","否"]
[16,"ECC-2025-02271","研究生A组","泛能源大数据-能源经济类","研究生A组",9,"校赛三等奖","否"]
[17,"ECC-2025-13089","研究生A组","能源金融与管理类","研究生A组",10,"校赛三等奖","否"]
[18,"ECC-2025-08209","研究生B组","泛能源大数据类","研究生B组",8,"校赛三等奖","否"]
[19,"ECC-2025-07778","研究生B组","泛能源大数据类","研究生B组",9,"校赛三等奖","否"]
[20,"ECC-2025-08618","研究生B组","泛能源大数据类","研究生B组",10,"校赛三等奖","否"]